[Lazarus] lazarus trunc IDE compile error

classic Classic list List threaded Threaded
5 messages Options
Reply | Threaded
Open this post in threaded view
|

[Lazarus] lazarus trunc IDE compile error

Free Pascal - Lazarus mailing list

Something went wrong?

last running trunc version:   Lazarus 2.1.0 r64270 FPC 3.2.0 x86_64-linux-gtk2

/home/john1/lazarus/components/lazcontrols/spinex.inc(255,13) Error: (4057) Can't determine which overloaded function to call
/usr/lib/fpc/3.2.0/units/x86_64-linux/rtl/math.ppu:math.pp(2580,10) Hint: (5039) Found declaration: CompareValue(const Extended;const Extended;Extended=` 0.00000000000000000000E+0000`):ShortInt;
/usr/lib/fpc/3.2.0/units/x86_64-linux/rtl/math.ppu:math.pp(2568,10) Hint: (5039) Found declaration: CompareValue(const Double;const Double;Double=` 0.00000000000000000000E+0000`):ShortInt;
/usr/lib/fpc/3.2.0/units/x86_64-linux/rtl/math.ppu:math.pp(2556,10) Hint: (5039) Found declaration: CompareValue(const Single;const Single;Single=` 0.00000000000000000000E+0000`):ShortInt;
/usr/lib/fpc/3.2.0/units/x86_64-linux/rtl/math.ppu:math.pp(2544,10) Hint: (5039) Found declaration: CompareValue(const QWord;const QWord):ShortInt;
/usr/lib/fpc/3.2.0/units/x86_64-linux/rtl/math.ppu:math.pp(2533,10) Hint: (5039) Found declaration: CompareValue(const Int64;const Int64):ShortInt;
/usr/lib/fpc/3.2.0/units/x86_64-linux/rtl/math.ppu:math.pp(2522,10) Hint: (5039) Found declaration: CompareValue(const LongInt;const LongInt):ShortInt;
spinex.pp(418) Fatal: (10026) There were 2 errors compiling module, stopping
Fatal: (1018) Compilation aborted
make[1]: *** [Makefile:3154: lazcontrols.ppu] Fehler 1
make[1]: Verzeichnis „/home/john1/lazarus/components/lazcontrols“ wird verlassen
make: *** [Makefile:3636: lazbuild] Fehler 2



--
_______________________________________________
lazarus mailing list
[hidden email]
https://lists.lazarus-ide.org/listinfo/lazarus
Reply | Threaded
Open this post in threaded view
|

Re: [Lazarus] lazarus trunc IDE compile error

Free Pascal - Lazarus mailing list
mpf ... this error occurs only on newest Deepin 20.1 (based on Debian 10??)

No probs on Manjaro XFCE!


Am 04.01.21 um 19:05 schrieb John Landmesser via lazarus:

Something went wrong?

last running trunc version:   Lazarus 2.1.0 r64270 FPC 3.2.0 x86_64-linux-gtk2

/home/john1/lazarus/components/lazcontrols/spinex.inc(255,13) Error: (4057) Can't determine which overloaded function to call
/usr/lib/fpc/3.2.0/units/x86_64-linux/rtl/math.ppu:math.pp(2580,10) Hint: (5039) Found declaration: CompareValue(const Extended;const Extended;Extended=` 0.00000000000000000000E+0000`):ShortInt;
/usr/lib/fpc/3.2.0/units/x86_64-linux/rtl/math.ppu:math.pp(2568,10) Hint: (5039) Found declaration: CompareValue(const Double;const Double;Double=` 0.00000000000000000000E+0000`):ShortInt;
/usr/lib/fpc/3.2.0/units/x86_64-linux/rtl/math.ppu:math.pp(2556,10) Hint: (5039) Found declaration: CompareValue(const Single;const Single;Single=` 0.00000000000000000000E+0000`):ShortInt;
/usr/lib/fpc/3.2.0/units/x86_64-linux/rtl/math.ppu:math.pp(2544,10) Hint: (5039) Found declaration: CompareValue(const QWord;const QWord):ShortInt;
/usr/lib/fpc/3.2.0/units/x86_64-linux/rtl/math.ppu:math.pp(2533,10) Hint: (5039) Found declaration: CompareValue(const Int64;const Int64):ShortInt;
/usr/lib/fpc/3.2.0/units/x86_64-linux/rtl/math.ppu:math.pp(2522,10) Hint: (5039) Found declaration: CompareValue(const LongInt;const LongInt):ShortInt;
spinex.pp(418) Fatal: (10026) There were 2 errors compiling module, stopping
Fatal: (1018) Compilation aborted
make[1]: *** [Makefile:3154: lazcontrols.ppu] Fehler 1
make[1]: Verzeichnis „/home/john1/lazarus/components/lazcontrols“ wird verlassen
make: *** [Makefile:3636: lazbuild] Fehler 2





--
_______________________________________________
lazarus mailing list
[hidden email]
https://lists.lazarus-ide.org/listinfo/lazarus
Reply | Threaded
Open this post in threaded view
|

Re: [Lazarus] lazarus trunc IDE compile error

Free Pascal - Lazarus mailing list
In reply to this post by Free Pascal - Lazarus mailing list
On 04/01/2021 19:05, John Landmesser via lazarus wrote:
>
> Something went wrong?
>
> last running trunc version:   Lazarus 2.1.0 r64270 FPC 3.2.0
> x86_64-linux-gtk2
>
>
Same with FPC 3.0.4 / 64bit / windows
--
_______________________________________________
lazarus mailing list
[hidden email]
https://lists.lazarus-ide.org/listinfo/lazarus
Reply | Threaded
Open this post in threaded view
|

Re: [Lazarus] lazarus trunc IDE compile error

Free Pascal - Lazarus mailing list
Am 04.01.2021 um 19:32 schrieb Martin Frb via lazarus:
> On 04/01/2021 19:05, John Landmesser via lazarus wrote:
>>
>> Something went wrong?
>>
>> last running trunc version:   Lazarus 2.1.0 r64270 FPC 3.2.0
>> x86_64-linux-gtk2
>>
>>
> Same with FPC 3.0.4 / 64bit / windows

Sorry, the initial fix for FPC-trunk introduced another issue with FPC
3.2. Should work now.
--
_______________________________________________
lazarus mailing list
[hidden email]
https://lists.lazarus-ide.org/listinfo/lazarus
Reply | Threaded
Open this post in threaded view
|

Re: [Lazarus] lazarus trunc IDE compile error

Free Pascal - Lazarus mailing list
Thanks. It compiles now!



Am 04.01.21 um 20:00 schrieb Werner Pamler via lazarus:

> Am 04.01.2021 um 19:32 schrieb Martin Frb via lazarus:
>> On 04/01/2021 19:05, John Landmesser via lazarus wrote:
>>>
>>> Something went wrong?
>>>
>>> last running trunc version:   Lazarus 2.1.0 r64270 FPC 3.2.0
>>> x86_64-linux-gtk2
>>>
>>>
>> Same with FPC 3.0.4 / 64bit / windows
>
> Sorry, the initial fix for FPC-trunk introduced another issue with FPC
> 3.2. Should work now.
--
_______________________________________________
lazarus mailing list
[hidden email]
https://lists.lazarus-ide.org/listinfo/lazarus