[Lazarus] laz fixes 2.0 error on macOS cocoa

classic Classic list List threaded Threaded
3 messages Options
Reply | Threaded
Open this post in threaded view
|

[Lazarus] laz fixes 2.0 error on macOS cocoa

Free Pascal - Lazarus mailing list
Dear All,
I updated my svn:

URL: https://svn.freepascal.org/svn/lazarus/branches/fixes_2_0

Relative URL: ^/branches/fixes_2_0

Repository Root: https://svn.freepascal.org/svn/lazarus

Repository UUID: 4005530d-fff6-0310-9dd1-cebe43e6787f

Revision: 61640


When I try to build lazarus I get:


Assembling (pipe) units/x86_64-darwin/wscomctrls.s

customupdown.inc(467,10) Error: Identifier not found "FUseWS"

treeview.inc(1878,16) Warning: Conversion between ordinals and pointers is not portable

treeview.inc(1935,22) Warning: Conversion between ordinals and pointers is not portable

comctrls.pp(4187) Fatal: There were 1 errors compiling module, stopping

Fatal: Compilation aborted

make[1]: *** [alllclunits.ppu] Error 1

make: *** [lazbuild] Error 2


Best regards,

Andrea


--
_______________________________________________
lazarus mailing list
[hidden email]
https://lists.lazarus-ide.org/listinfo/lazarus
Reply | Threaded
Open this post in threaded view
|

Re: [Lazarus] laz fixes 2.0 error on macOS cocoa

Free Pascal - Lazarus mailing list
Try to update to r61642

On Mon, Jul 29, 2019 at 7:54 AM Andrea Mauri via lazarus <[hidden email]> wrote:
Dear All,
I updated my svn:

URL: https://svn.freepascal.org/svn/lazarus/branches/fixes_2_0

Relative URL: ^/branches/fixes_2_0

Repository Root: https://svn.freepascal.org/svn/lazarus

Repository UUID: 4005530d-fff6-0310-9dd1-cebe43e6787f

Revision: 61640


When I try to build lazarus I get:


Assembling (pipe) units/x86_64-darwin/wscomctrls.s

customupdown.inc(467,10) Error: Identifier not found "FUseWS"

treeview.inc(1878,16) Warning: Conversion between ordinals and pointers is not portable

treeview.inc(1935,22) Warning: Conversion between ordinals and pointers is not portable

comctrls.pp(4187) Fatal: There were 1 errors compiling module, stopping

Fatal: Compilation aborted

make[1]: *** [alllclunits.ppu] Error 1

make: *** [lazbuild] Error 2


Best regards,

Andrea

--
_______________________________________________
lazarus mailing list
[hidden email]
https://lists.lazarus-ide.org/listinfo/lazarus

--
_______________________________________________
lazarus mailing list
[hidden email]
https://lists.lazarus-ide.org/listinfo/lazarus
Reply | Threaded
Open this post in threaded view
|

Re: [Lazarus] laz fixes 2.0 error on macOS cocoa

Free Pascal - Lazarus mailing list
Updated and compiled. Thank you!

Il giorno lun 29 lug 2019 alle ore 14:41 Dmitry Boyarintsev via lazarus <[hidden email]> ha scritto:
Try to update to r61642

On Mon, Jul 29, 2019 at 7:54 AM Andrea Mauri via lazarus <[hidden email]> wrote:
Dear All,
I updated my svn:

URL: https://svn.freepascal.org/svn/lazarus/branches/fixes_2_0

Relative URL: ^/branches/fixes_2_0

Repository Root: https://svn.freepascal.org/svn/lazarus

Repository UUID: 4005530d-fff6-0310-9dd1-cebe43e6787f

Revision: 61640


When I try to build lazarus I get:


Assembling (pipe) units/x86_64-darwin/wscomctrls.s

customupdown.inc(467,10) Error: Identifier not found "FUseWS"

treeview.inc(1878,16) Warning: Conversion between ordinals and pointers is not portable

treeview.inc(1935,22) Warning: Conversion between ordinals and pointers is not portable

comctrls.pp(4187) Fatal: There were 1 errors compiling module, stopping

Fatal: Compilation aborted

make[1]: *** [alllclunits.ppu] Error 1

make: *** [lazbuild] Error 2


Best regards,

Andrea

--
_______________________________________________
lazarus mailing list
[hidden email]
https://lists.lazarus-ide.org/listinfo/lazarus
--
_______________________________________________
lazarus mailing list
[hidden email]
https://lists.lazarus-ide.org/listinfo/lazarus

--
_______________________________________________
lazarus mailing list
[hidden email]
https://lists.lazarus-ide.org/listinfo/lazarus