[Lazarus] compiling svn Lazarus -> error

classic Classic list List threaded Threaded
3 messages Options
Reply | Threaded
Open this post in threaded view
|  
Report Content as Inappropriate

[Lazarus] compiling svn Lazarus -> error

Free Pascal - Lazarus mailing list
does anyone got the same error when compiling svn Lazarus?

Revision 54762

Lazarus 1.9.0 r54742 FPC 3.0.0 x86_64-linux-gtk2 Revision 54762

message:

(3104) Compiling directorycacher.pas
/home/john1/lazarus/components/codetools/directorycacher.pas(1257,14)
Error: (3026) Wrong number of parameters specified for call to
"IsValidIdent"
Error: (5088) Found declaration: IsValidIdent(const AnsiString):Boolean;
directorycacher.pas(1906) Fatal: (10026) There were 2 errors compiling
module, stopping
Fatal: (1018) Compilation aborted
Makefile:2615: die Regel für Ziel »codetools.ppu« scheiterte
make[1]: *** [codetools.ppu] Fehler 1
make[1]: Verzeichnis »/home/john1/lazarus/components/codetools« wird
verlassen
Makefile:3140: die Regel für Ziel »codetools« scheiterte
make: *** [codetools] Fehler 2


--
_______________________________________________
Lazarus mailing list
[hidden email]
http://lists.lazarus-ide.org/listinfo/lazarus
Reply | Threaded
Open this post in threaded view
|  
Report Content as Inappropriate

Re: [Lazarus] compiling svn Lazarus -> error

Free Pascal - Lazarus mailing list
Same here!

-Torsten.

On 2017-04-28 11:05, John Landmesser via Lazarus wrote:

> does anyone got the same error when compiling svn Lazarus?
>
> Revision 54762
>
> Lazarus 1.9.0 r54742 FPC 3.0.0 x86_64-linux-gtk2 Revision 54762
>
> message:
>
> (3104) Compiling directorycacher.pas
> /home/john1/lazarus/components/codetools/directorycacher.pas(1257,14)
> Error: (3026) Wrong number of parameters specified for call to
> "IsValidIdent"
> Error: (5088) Found declaration: IsValidIdent(const AnsiString):Boolean;
> directorycacher.pas(1906) Fatal: (10026) There were 2 errors compiling
> module, stopping
> Fatal: (1018) Compilation aborted
> Makefile:2615: die Regel für Ziel »codetools.ppu« scheiterte
> make[1]: *** [codetools.ppu] Fehler 1
> make[1]: Verzeichnis »/home/john1/lazarus/components/codetools« wird
> verlassen
> Makefile:3140: die Regel für Ziel »codetools« scheiterte
> make: *** [codetools] Fehler 2
>
>

--
_______________________________________________
Lazarus mailing list
[hidden email]
http://lists.lazarus-ide.org/listinfo/lazarus
Reply | Threaded
Open this post in threaded view
|  
Report Content as Inappropriate

Re: [Lazarus] compiling svn Lazarus -> error

Free Pascal - Lazarus mailing list
In reply to this post by Free Pascal - Lazarus mailing list
On Fri, 28 Apr 2017 11:05:23 +0200
John Landmesser via Lazarus <[hidden email]> wrote:

> does anyone got the same error when compiling svn Lazarus?
>
> Revision 54762
>
> Lazarus 1.9.0 r54742 FPC 3.0.0 x86_64-linux-gtk2 Revision 54762
>
> message:
>
> (3104) Compiling directorycacher.pas
> /home/john1/lazarus/components/codetools/directorycacher.pas(1257,14)
> Error: (3026) Wrong number of parameters specified for call to
> "IsValidIdent"

Sorry. My fault. Fixed.

Mattias
--
_______________________________________________
Lazarus mailing list
[hidden email]
http://lists.lazarus-ide.org/listinfo/lazarus
Loading...